{"text_format":"1","workbook":"xlsx","n_sheets":3,"sheets":["Analyses_demandées","Recherche","Outlook"],"not_rendered":{"charts":0,"images":1,"macros":1,"external_links":0,"defined_names":4,"comments":0,"pivot_tables":0},"unopened":[],"bounds":{"document_bytes":16777216,"sheet_cells":100000,"rows_first":2000,"rows_last":500,"rows_between":2000,"halvings":0,"cell_chars":16384,"cell_head_chars":4096},"cells_cut":0,"cells_raw":0,"read":"whole","date_system":"1900"}

{"sheet":"Analyses_demandées","index":0,"n_rows":45,"n_cols":13,"rows_kept":45,"cut":false,"hidden":false,"merged":[[2,1,2,12],[4,5,4,6],[40,4,40,9],[1,11,1,12]]}
[null,"Annexe - Demande d'analyse pour projet de recherche",null,null,null,"N° projet"]
[null,null,null,null,null,"Addendum","Oui/Non",null,null,null,null,"                        DMLP_03_ANN_002 v4.0"]
[null,"Merci de compléter cette annexe en sélectionnant les analyses souhaitées dans la colonne B \"Analyse\" ci-dessous. Les 3 premières lettres de l'analyse souhaitée peuvent être saisies dans la case pour affiner la recherche.                                          \nIl y a également, le catalogue complet des analyses qui est disponible dans l'onglet \"Recherche\" (ctrl+f pour effectuer une recherche). Depuis là, le nom de l'analyse peut être copier et coller dans la colonne B \"Analyse\".\nLes colonnes \"Nb échantillons\", \"type d'échantillon\" et \"type de traitement analytique\" doivent également être complétées.\nLes analyses externalisées ou sous-traitées ne peuvent pas faire partie du budget d'un projet d'étude.\n\nCette liste correctement et complétement remplies assure un traitement de la demande plus rapide."]
[]
[null,"Type de financement de l'étude:       ","Autre financement (cf formulaire de demande)",null,"Rabais octroyé:",0.1]
[]
[null,"Analyse","Domaine","Nb échantillons","Code tarification Molis","Nbre de points LA","ajout suffixe C/non C\n4707.10 (1.80) ou\n4707.20 (0.90)","Prix proposé","Total proposé","CGRA/B créditeur labo","Type d'échantillon","Type de traitement analytique ","Commentaire"]
[null,null,{"$f":"IF(ISNA(VLOOKUP($B8,Recherche!A:E,5,FALSE)),\" \",VLOOKUP($B8,Recherche!A:E,5,FALSE))","v":" "},null,null,null,null,{"$f":"ROUND(IF($F$5=10%,(($F8+$G8)*0.9),($F8+$G8)),1)","v":0},{"$f":"D8*H8","v":0}]
[null,null,{"$f":"IF(ISNA(VLOOKUP($B9,Recherche!A:E,5,FALSE)),\" \",VLOOKUP($B9,Recherche!A:E,5,FALSE))","v":" "},null,null,null,null,{"$f":"ROUND(IF($F$5=10%,(($F9+$G9)*0.9),($F9+$G9)),1)","v":0},{"$f":"D9*H9","v":0}]
[null,null,{"$f":"IF(ISNA(VLOOKUP($B10,Recherche!A:E,5,FALSE)),\" \",VLOOKUP($B10,Recherche!A:E,5,FALSE))","v":" "},null,null,null,null,0,0]
[null,null,{"$f":"IF(ISNA(VLOOKUP($B11,Recherche!A:E,5,FALSE)),\" \",VLOOKUP($B11,Recherche!A:E,5,FALSE))","v":" "},null,null,null,null,0,0]
[null,null,{"$f":"IF(ISNA(VLOOKUP($B12,Recherche!A:E,5,FALSE)),\" \",VLOOKUP($B12,Recherche!A:E,5,FALSE))","v":" "},null,null,null,null,0,0]
[null,null,{"$f":"IF(ISNA(VLOOKUP($B13,Recherche!A:E,5,FALSE)),\" \",VLOOKUP($B13,Recherche!A:E,5,FALSE))","v":" "},null,null,null,null,0,0]
[null,null,{"$f":"IF(ISNA(VLOOKUP($B14,Recherche!A:E,5,FALSE)),\" \",VLOOKUP($B14,Recherche!A:E,5,FALSE))","v":" "},null,null,null,null,0,0]
[null,null,{"$f":"IF(ISNA(VLOOKUP($B15,Recherche!A:E,5,FALSE)),\" \",VLOOKUP($B15,Recherche!A:E,5,FALSE))","v":" "},null,null,null,null,0,0]
[null,null,null,null,null,null,null,0,0]
[null,null,{"$f":"IF(ISNA(VLOOKUP($B17,Recherche!A:E,5,FALSE)),\" \",VLOOKUP($B17,Recherche!A:E,5,FALSE))","v":" "},null,null,null,null,0,0]
[null,null,{"$f":"IF(ISNA(VLOOKUP($B18,Recherche!A:E,5,FALSE)),\" \",VLOOKUP($B18,Recherche!A:E,5,FALSE))","v":" "},null,null,null,null,0,0]
[null,null,{"$f":"IF(ISNA(VLOOKUP($B19,Recherche!A:E,5,FALSE)),\" \",VLOOKUP($B19,Recherche!A:E,5,FALSE))","v":" "},null,null,null,null,0,0]
[null,null,{"$f":"IF(ISNA(VLOOKUP($B20,Recherche!A:E,5,FALSE)),\" \",VLOOKUP($B20,Recherche!A:E,5,FALSE))","v":" "},null,null,null,null,0,0]
[null,null,{"$f":"IF(ISNA(VLOOKUP($B21,Recherche!A:E,5,FALSE)),\" \",VLOOKUP($B21,Recherche!A:E,5,FALSE))","v":" "},null,null,null,null,0,0]
[null,null,{"$f":"IF(ISNA(VLOOKUP($B22,Recherche!A:E,5,FALSE)),\" \",VLOOKUP($B22,Recherche!A:E,5,FALSE))","v":" "},null,null,null,null,0,0]
[null,null,{"$f":"IF(ISNA(VLOOKUP($B23,Recherche!A:E,5,FALSE)),\" \",VLOOKUP($B23,Recherche!A:E,5,FALSE))","v":" "},null,null,null,null,0,0]
[null,null,{"$f":"IF(ISNA(VLOOKUP($B25,Recherche!A:E,5,FALSE)),\" \",VLOOKUP($B25,Recherche!A:E,5,FALSE))","v":" "},null,null,null,null,0,0]
[null,null,null,null,null,null,null,0,0]
[null,null,{"$f":"IF(ISNA(VLOOKUP($B26,Recherche!A:E,5,FALSE)),\" \",VLOOKUP($B26,Recherche!A:E,5,FALSE))","v":" "},null,null,null,null,0,0]
[null,null,{"$f":"IF(ISNA(VLOOKUP($B27,Recherche!A:E,5,FALSE)),\" \",VLOOKUP($B27,Recherche!A:E,5,FALSE))","v":" "},null,null,null,null,0,0]
[null,null,{"$f":"IF(ISNA(VLOOKUP($B28,Recherche!A:E,5,FALSE)),\" \",VLOOKUP($B28,Recherche!A:E,5,FALSE))","v":" "},null,null,null,null,0,0]
[null,null,{"$f":"IF(ISNA(VLOOKUP($B29,Recherche!A:E,5,FALSE)),\" \",VLOOKUP($B29,Recherche!A:E,5,FALSE))","v":" "},null,null,null,null,0,0]
[null,null,{"$f":"IF(ISNA(VLOOKUP($B30,Recherche!A:E,5,FALSE)),\" \",VLOOKUP($B30,Recherche!A:E,5,FALSE))","v":" "},null,null,null,null,0,0]
[null,null,{"$f":"IF(ISNA(VLOOKUP($B31,Recherche!A:E,5,FALSE)),\" \",VLOOKUP($B31,Recherche!A:E,5,FALSE))","v":" "},null,null,null,null,0,0]
[null,null,{"$f":"IF(ISNA(VLOOKUP($B32,Recherche!A:E,5,FALSE)),\" \",VLOOKUP($B32,Recherche!A:E,5,FALSE))","v":" "},null,null,null,null,0,0]
[null,null,{"$f":"IF(ISNA(VLOOKUP($B33,Recherche!A:E,5,FALSE)),\" \",VLOOKUP($B33,Recherche!A:E,5,FALSE))","v":" "},null,null,null,null,0,0]
[null,null,{"$f":"IF(ISNA(VLOOKUP($B34,Recherche!A:E,5,FALSE)),\" \",VLOOKUP($B34,Recherche!A:E,5,FALSE))","v":" "},null,null,null,null,0,0]
[null,null,{"$f":"IF(ISNA(VLOOKUP($B35,Recherche!A:E,5,FALSE)),\" \",VLOOKUP($B35,Recherche!A:E,5,FALSE))","v":" "},null,null,null,null,0,0]
[null,null,{"$f":"IF(ISNA(VLOOKUP($B36,Recherche!A:E,5,FALSE)),\" \",VLOOKUP($B36,Recherche!A:E,5,FALSE))","v":" "},null,null,null,null,0,0]
[null,null,null,null,null,null,null,"Total:",{"$f":"SUM(I8:I36)","v":0}]
[null,null,null,null,null,null,null,"Taxe administrative:",{"$f":"ROUND(I37*0.05,0)","v":0}]
[]
[]
{"$rows_left_out":6}
{"sheet":"Recherche","index":1,"n_rows":1786,"n_cols":10,"rows_kept":1786,"cut":false,"hidden":false,"merged":[]}
["Pour effectuer une recherche: Ctrl+f, indiquer le terme recherché et reporter le nom de l'analyse (colonne A) dans l'onglet Analyses_demandées sous Analyse (colonne B)"]
[]
["Nom de l'analyse","Nom fiche","Mots clés","Sous-titre","Groupe","Attention","But de l'analyse","Indication diagnostique","Préparation du patient","Synonyme"]
["5-HIAA - Urine 24 h","5-hiaa","","Urine 24 h","Catécholamines","","","Syndrome carcinoïde","<p>72h avant et pendant la collecte, ne pas absorber de café, thé, chocolat, banane, noix, amandes, ananas, aubergine, kiwi, avocat, prune, tomate et alcool.<br /></p>","Acide 5-hydroxy-indole acétique, HIAA-5, hydroxy-indole-acétate-5, 5-hydroxy-indole-acétate"]
["5-HIAA - Sang","5-hiaa-1","","Sang","Catécholamines","","","Syndrome carcinoïde<br />","<p>24h avant le prélèvement, ne pas absorber de noix, banane, chocolat, prune, avocat, aubergine, tomate, ananas, kiwi, plantain, caféine (café, thé), nicotine, alcool<br /><br /></p>\r\n<p>Etre à jeûn<br /></p>","5-HIAA, Acide 5-hydroxy-indole acétique, HIAA-5, hydroxyindole acetate-5, 5-hydroxyindole acétate"]
["6-Mercaptopurine (6-TG, 6-MMP) - Sang","6-mercaptopurine-6-tg-6-mmp","Immunosupresseur, Anticancéreux","Sang","Pharmacologie","","<p>Dosage du taux sanguin (TDM) de ﻿6-Mercaptopurine: 6-TG (6-Thioguanine) et 6-MMP (6-Methylmercaptopurine). ﻿<br /></p>","Sur avis du spécialiste. L’interprétation clinique (TDM) du dosage n’est actuellement pas validée pour toutes les indications thérapeutiques.","","Puri-Nethol, Xaluprine\r\n6-MP, 6-MMP, 6-Methylmercaptopurine, 6-TG, 6-Thioguanine, Azathioprine, 6-TGN, 6-Thioguanine nucleotide, 6tg, 6mmp, 6tgn"]
["Abacavir - Sang","abacavir","Antirétroviraux, anti-HIV, Antirétroviral, NRTI, analogue nucléosidique et nucléotidique","Sang","Pharmacologie","","<p>Dosage et interprétation pharmacocinétique de taux sanguin d'abacavir (absence d'intervalle de référence, évaluation seulement de la plausibilité du taux)</p>","<p>Suivi thérapeutique, réponse insatisfaisante, suspicion de toxicité, suspicion d'interaction médicamenteuse, doute sur la compliance, grossesse, étude</p>","","Ziagen®, dans Triumeq®, dans Kivexa®, dans Trizivir®"]
["Abemaciclib - Sang","abemaciclib","Anticancéreux ciblés, TKI, inhibiteur tirosine kinase, inhibiteur protéine kinase, PKI","Sang","Pharmacologie","","Dosage de taux sanguin d'abemaciclib<br />","Sur avis du spécialiste. L’interprétation clinique (TDM) ou pharmacocinétique des dosage n’est actuellement pas validée.","","Verzenios ®"]
["Acanthamoeba spp PCR - Frottis œil","acanthamoeba-spp-pcr","","Frottis œil","Microbio moléculaire","","Recherche d'amibes Acanthamoeba spp dans les prélèvement oculaires","","",""]
["Acanthamoeba spp PCR - Liquide humeur aqueuse","acanthamoeba-spp-pcr-1","","Liquide humeur aqueuse","Microbio moléculaire","","Recherche d'amibes Acanthamoeba spp dans les prélèvement oculaires","","",""]
["Acanthamoeba spp PCR - Liquide humeur vitrée","acanthamoeba-spp-pcr-2","","Liquide humeur vitrée","Microbio moléculaire","","Recherche d'amibes Acanthamoeba spp dans les prélèvement oculaires","","",""]
["Acanthamoeba spp PCR - Liquide verre de contact","acanthamoeba-spp-pcr-3","","Liquide verre de contact","Microbio moléculaire","","Recherche d'amibes Acanthamoeba spp dans les prélèvement oculaires","","",""]
["Acanthamoeba spp PCR - Sécrétions conjonctivales","acanthamoeba-spp-pcr-4","","Sécrétions conjonctivales","Microbio moléculaire","","Recherche d'amibes Acanthamoeba spp dans les prélèvement oculaires","","",""]
["Acanthamoeba spp PCR - Biopsie","acanthamoeba-spp-pcr-5","","Biopsie","Microbio moléculaire","","Recherche d'amibes Acanthamoeba spp dans les prélèvement oculaires","","",""]
["Aciclovir - Sang","aciclovir","Antiviraux, antiviral","Sang","Pharmacologie","","Dosage et interprétation pharmacologique (TDM) de taux sanguin d'aciclovir (intervalle de référence disponible)","Suivi thérapeutique, réponse insatisfaisante, suspicion de toxicité, suspicion d'interaction médicamenteuse, doute sur la compliance, grossesse, étude","","Zovirax®"]
["Acide aminé spécifique - Urine","acide-amine-specifique","cystine, lysine, arginine, ornithine,  IEM, EIM, erreurs innées du métabolisme, Inborn Errors of Metabolism","Urine","Chimie clinique","","","","","Acide aminé, acides aminés, amines (acides…),aminoacides, arginine, cystine, lysine, ornithine"]
["Acide aminé spécifique - Sang","acide-amine-specifique-1","phénylalanine, tyrosine, citrulline, arginine, glutamine, méthionine, cystine, homocystine, leucine, isoleucine, valine, alloisoleucine,tryptophane, CHD, cystine-homocystine disulfide,  IEM, EIM, erreurs innées du métabolisme, Inborn Errors of Metabolism","Sang","Chimie clinique","","","","Patient à jeun (>4h après le dernier repas)","Acide aminé, Acides aminés, aminés (acides …) Aminoacides"]
["Acide aminé spécifique - LCR","acide-amine-specifique-2","sérine, glycine","LCR","Chimie clinique","","","Erreurs innées du métabolisme des acides aminés","","amino acid, aminoacids, amines"]
["acide beta-hydroxybutyrique - Sang","acide-beta-hydroxybutyrique","","Sang","Chimie clinique","","Screening urgent de l'acide 3-hydroxybutyrique. A ne pas confondre avec les corps cétoniques quantitatifs ni les demandes d'acide gamma-hydroxybutyrique.","Dans les cas de déficit graves de la beta-oxydation et des diabètes décompensés","Paient à jeun (&gt; 4 h après le dernier repas)","beta hydroxybutyrate, acide 3-hydroxybutyrique, acide 3-hydroxy butyrique, BHB, 3-hydroxybutyrate, beta-hydroxy butyrate, 3-hydroxy butyrate"]
["Acide gamma hydro butyrique - Sang","acide-gamma-hydro-butyrique","","Sang","Toxicologie","","Dosage demandé à des fins légales <br />La manupulation de ces kits est très importante d'un point de vue légal. Lire et suivre attentivement les instructions se touvant à l'intérieur du kit","Le kit peut-être obtenu auprès du laboratoire de toxicologie et chimie forensique","","Drogue du violeur, gamma hydroxybutyrate, GHB"]
["Acide gamma hydro butyrique - Urine","acide-gamma-hydro-butyrique-1","","Urine","Toxicologie","","Dosage demandé à des fins légales <br />La manupulation de ces kits est très importante d'un point de vue légal. Lire et suivre attentivement les instructions se touvant à l'intérieur du kit","Le kit peut-être obtenu auprès du laboratoire de toxicologie et chimie forensique","","Drogue du violeur, gamma hydroxybutyrate, GHB"]
["Acide homovanillique - Urine 24 h","acide-homovanillique","","Urine 24 h","Catécholamines","","","<p>Neuroblastome</p>","<p>J-3 arrêt médicaments suivants, selon OM: Adelphan, Aldomet, artérénol, dopamine, isoprénaline, Isuprel, Novadral.﻿</p>\r\n<p>Aucune préparation pour d'autres examens (lavement, urographie,…).</p>\r\n<p>Eviter les situations de stress.</p>\r\n<p>24h avant et pendant la collecte, ne pas absorber de café, thé, chocolat, banane, noix, amandes, ananas, aubergine, kiwi, avocat, prune, tomate et alcool.</p>","HMA, HVA"]
["Acide homovanillique - Spot Urinaire - Neuroblastome","acide-homovanillique-1","","Spot Urinaire - Neuroblastome","Catécholamines","","","Neuroblastome","<p>J-3 arrêt médicaments suivants, selon OM: Adelphan, Aldomet, artérénol, dopamine, isoprénaline, Isuprel, Novadral.</p>\r\n<p>Aucune préparation pour d'autres examens (lavement, urographie,…).<br /></p>\r\n<p>Eviter les situations de stress.<br /></p>\r\n<p>24h avant et pendant la collecte, ne pas absorber de café, thé, chocolat, banane, noix, amandes, ananas, aubergine, kiwi, avocat, prune, tomate et alcool.</p>","HMA, HVA"]
["acide p-aminosalicylique (PAS) - Sang","acide-p-aminosalicylique-pas","tuberculose, tuberculeux, anti-tuberculeux, Antibiotique, MDR, XDR,  PAS,  P-aminosalicylic acid","Sang","Pharmacologie","","Dosage et interprétation pharmacocinétique de taux sanguin de l'acide p-aminosalicylique","<p>Sur avis du spécialiste. L’interprétation clinique (TDM) du dosage n’est actuellement pas validée. </p>\r\n<p><br /></p>","","Granupas (EMA)"]
["Acide vanylmandélique - Urine 24 h","acide-vanylmandelique","","Urine 24 h","Catécholamines","","","<p>Neuroblastomes</p>","<p>J-3 arrêt médicaments suivants, selon OM: Adelphan, Aldomet, artérénol, dopamine, isoprénaline, Isuprel, Novadral.</p>\r\n<p>Aucune préparation pour d'autres examens (lavement, urographie,…).</p>\r\n<p>Eviter les situations de stress.</p>\r\n<p>24h avant et pendant la collecte, ne pas absorber de café, thé, chocolat, banane, noix, amandes, ananas, aubergine, kiwi, avocat, prune, tomate et alcool.</p>","AVM, VMA, vanylmandélate, vanilmandelic acid, vanilmandélate, vanilmandélique"]
["Acide vanylmandélique - Spot Urinaire - Neuroblastome","acide-vanylmandelique-1","","Spot Urinaire - Neuroblastome","Catécholamines","","","Neuroblastome","<p>J-3 arrêt médicaments suivants, selon OM: Adelphan, Aldomet, artérénol, dopamine, isoprénaline, Isuprel, Novadral.</p>\r\n<p>Aucune préparation pour d'autres examens (lavement, urographie,…).<br /></p>\r\n<p>Eviter les situations de stress.<br /></p>\r\n<p>24h avant et pendant la collecte, ne pas absorber de café, thé, chocolat, banane, noix, amandes, ananas, aubergine, kiwi, avocat, prune, tomate et alcool.</p>","AVM, VMA, vanylmandélate, vanilmandelic acid, vanilmandélate, vanilmandélique"]
["Acides aminés - Urine","acides-amines","cystine, lysine, ornithine, arginine,  IEM, EIM, erreurs innées du métabolisme, Inborn Errors of Metabolism","Urine","Chimie clinique","","","","Patient à jeun (&gt;4h après le dernier repas)","Aminoacides, aminoacids, amines, "]
["Acides aminés - LCR","acides-amines-1","IEM, EIM, erreurs innées du métabolisme, Inborn Errors of Metabolism","LCR","Chimie clinique","","","Erreurs innées du métabolisme des acides aminés","","Amines (acides…), aminoacids, aminoacides"]
["Acides aminés - Sang","acides-amines-2","phenylalanine, phénylalanine, glutamine, tryptophane, citrulline, tyrosine, leucine, isoleucine, méthionine, cystine, IEM, EIM, erreurs innées du métabolisme, Inborn Errors of Metabolism","Sang","Chimie clinique","","","","Patient à jeun (>4h après le dernier repas)","Acide aminé, acides aminés, amines (acides…),aminoacides, aminoacids, profil acides aminés"]
["Acides aminés - Urine 24h","acides-amines-3","IEM, EIM, erreurs innées du métabolisme, Inborn Errors of Metabolism","Urine 24h","Chimie clinique","","","","","Acide aminé, acides aminés, amines (acides…),aminoacides"]
["Acides gras libres (NEFA) - Sang","acides-gras-libres-nefa","","Sang","Chimie clinique","","","","Patient à jeûn (12 heures).","Acides gras non estérifiés, free fatty acids, non esterified fatty acids, NEFA"]
["Acides organiques - Urine","acides-organiques","Acide méthylmalonique, méthylmalonate, méthylmalonique acid, MMA, profil acides organiques, mévalonate,, IEM, EIM, erreurs innées du métabolisme, Inborn Errors of Metabolism","Urine","Chimie clinique","","","","","organic acids"]
["Acides organiques - LCR","acides-organiques-1","","LCR","Chimie clinique","","","","","Acide organique, acides organiques"]
["ACTH (corticotrophine) - Sang","acth-corticotrophine","corticotropine, adrénocorticotropine","Sang","Chimie clinique","Acheminer immédiatement le tube sur la glace","","","","Adrénocorticotrophine, corticostimuline, hormone corticotrope"]
["Actinomyces - Culture - Abcès cervical","actinomyces-culture-4","pus","Abcès cervical","Microbiologie","","Recherche par culture d'<em>Actinomyces </em>dans l'abcès cervical.","","",""]
["Actinomyces - Culture - Abcès anal, para-anal","actinomyces-culture-5","pus","Abcès anal, para-anal","Microbiologie","","Recherche par culture d'<em>Actinomyces </em>dans l'abcès anal, para-anal.","","",""]
["Actinomyces - Culture - Abcès paroi abdominale","actinomyces-culture-6","pus","Abcès paroi abdominale","Microbiologie","","Recherche par culture d'<em>Actinomyces </em>dans l'abcès de paroi abdominale.","","",""]
["Actinomyces - Culture - Abcès du poumon","actinomyces-culture-7","pus","Abcès du poumon","Microbiologie","","Recherche par culture d'<em>Actinomyces </em>dans l'abcès pulmonaire.","","",""]
["Actinomyces - Culture - Abcès du sein","actinomyces-culture-8","pus","Abcès du sein","Microbiologie","","Recherche par culture d'<em>Actinomyces </em>dans l'abcès du sein.","","",""]
["Actinomyces - Culture - Abcès","actinomyces-culture-9","pus","Abcès","Microbiologie","","Recherche par culture d'<em>Actinomyces </em>dans les échantillons d'abcès.","","",""]
{"$rows_left_out":1747}
{"sheet":"Outlook","index":2,"n_rows":4,"n_cols":5,"rows_kept":4,"cut":false,"hidden":true,"merged":[]}
[]
["Projet",null,"A:","dmlp.etudes@chuv.ch"]
[null,null,"Sujet:",{"$f":"CONCATENATE(E3,\" \",B2)","v":"Demande de projet N° "},"Demande de projet N°"]
[null,null,"Message:","Bonjour,\n\nLe devis est complété pour UB (à modifier).\n\nSi différent, les analyses non-prévues dans le budget sont à créditer sur CGRA/CGRB (à modifier).\n\nMeilleures salutations."]